Fedora-Linux.nl Forumindex Fedora-Linux.nl
Het forum van Fedora-Linux.nl.
Deze site wordt gehost door Exonet Internet Services
 
 FAQFAQ   ZoekenZoeken   GebruikerslijstGebruikerslijst   GebruikersgroepenGebruikersgroepen   RegistrerenRegistreren 
 ProfielProfiel   Log in om je privéberichten te bekijkenLog in om je privéberichten te bekijken   InloggenInloggen 

TV kaart installeren

 
Nieuw onderwerp plaatsen   Reageren    Fedora-Linux.nl Forumindex -> Hardware
Vorige onderwerp :: Volgende onderwerp  
Auteur Bericht
rsgvv



Geregistreerd op: 11 Jun 2006
Berichten: 46

BerichtGeplaatst: Di Jul 29, 2008 4:48 pm    Onderwerp: TV kaart installeren Reageren met citaat

Ik heb Fedora 9 en ik zou graag via deze stappen:
http://www.linuxtv.org/v4lwiki/index.php/Trident_TM6000
me tv kaart aan de praat krijgen. Heb via een programma gevonden dat de tv kaart onder Fedora wordt herkend als: Trident TM6000

En dus begin ik de commando uit te voeren:
hg clone http://linuxtv.org/hg/v4l-dvb

En krijg meteen al de volgende fout:
bash: hg: opdracht niet gevonden

En waar kan ik het beste de tv kaart installeren. Heb namelijke nog nooit zoiets ge´nstalleerd. heb altijd maar gewoon de RPM' s gebruikt om alles te installeren.

Alvast bedankt voor de hulp Very Happy
Terug naar boven
Profiel bekijken Stuur privébericht
rsgvv



Geregistreerd op: 11 Jun 2006
Berichten: 46

BerichtGeplaatst: Di Jul 29, 2008 10:40 pm    Onderwerp: Reageren met citaat

Het is opgelost Rolling Eyes Moest HQ installeren.
Maar nu duikt er weer een andere probleem op. Als ik na alle stappen de commando make opgeef. Dan krijg ik dit op het einde:

(vervang ................. door nog zo'n melding als wat er onder en boven staat.)


ln: cannot remove `./saa7110.c': Permission denied
ln: cannot remove `./vino.c': Permission denied
ln: cannot remove `./vivi.c': Permission denied
........................
ln: cannot remove `./w9968cf_decoder.h': Permission denied
ln: cannot remove `./saa7127.c': Permission denied
make[1]: *** [links] Fout 123
make[1]: Map '/home/rsgvv/v4l-dvb/v4l' wordt verlaten
make: *** [all] Fout 2
[rsgvv@merom v4l-dvb]$ makefile
bash: makefile: command not found
[rsgvv@merom v4l-dvb]$ su root
Wachtwoord:
[root@merom v4l-dvb]# make
make -C /home/rsgvv/v4l-dvb/v4l
make[1]: Map '/home/rsgvv/v4l-dvb/v4l' wordt binnengegaan
creating symbolic links...
Kernel build directory is /lib/modules/2.6.25.11-97.fc9.i686/build
make -C /lib/modules/2.6.25.11-97.fc9.i686/build SUBDIRS=/home/rsgvv/v4l-dvb/v4l modules
make[2]: Entering directory `/usr/src/kernels/2.6.25.11-97.fc9.i686'
CC [M] /home/rsgvv/v4l-dvb/v4l/tm6000.o
/home/rsgvv/v4l-dvb/v4l/tm6000.c: In function 'tm6000_poll_remote':
/home/rsgvv/v4l-dvb/v4l/tm6000.c:293: warning: passing argument 1 of 'schedule_delayed_work' from incompatible pointer type
/home/rsgvv/v4l-dvb/v4l/tm6000.c: In function 'tm6000_start_stream':
/home/rsgvv/v4l-dvb/v4l/tm6000.c:297: warning: unused variable 'errCode'
/home/rsgvv/v4l-dvb/v4l/tm6000.c:297: warning: unused variable 'i'
/home/rsgvv/v4l-dvb/v4l/tm6000.c: In function 'tm6000_zl10353_i2c_xfer':
/home/rsgvv/v4l-dvb/v4l/tm6000.c:421: warning: unused variable 'k'
..............................
/home/rsgvv/v4l-dvb/v4l/tm6000.c: In function 'probe':
/home/rsgvv/v4l-dvb/v4l/tm6000.c:2005: error: too few arguments to function 'dvb_register_adapter'
/home/rsgvv/v4l-dvb/v4l/tm6000.c:2059: warning: label 'err' defined but not used
make[3]: *** [/home/rsgvv/v4l-dvb/v4l/tm6000.o] Error 1
make[2]: *** [_module_/home/rsgvv/v4l-dvb/v4l] Error 2
make[2]: Leaving directory `/usr/src/kernels/2.6.25.11-97.fc9.i686'
make[1]: *** [default] Fout 2
make[1]: Map '/home/rsgvv/v4l-dvb/v4l' wordt verlaten
make: *** [all] Fout 2
[root@merom v4l-dvb]# clear

[root@merom v4l-dvb]# make
make -C /home/rsgvv/v4l-dvb/v4l
make[1]: Map '/home/rsgvv/v4l-dvb/v4l' wordt binnengegaan
creating symbolic links...
Kernel build directory is /lib/modules/2.6.25.11-97.fc9.i686/build
make -C /lib/modules/2.6.25.11-97.fc9.i686/build SUBDIRS=/home/rsgvv/v4l-dvb/v4l modules
make[2]: Entering directory `/usr/src/kernels/2.6.25.11-97.fc9.i686'
CC [M] /home/rsgvv/v4l-dvb/v4l/tm6000.o
/home/rsgvv/v4l-dvb/v4l/tm6000.c: In function 'tm6000_poll_remote':
/home/rsgvv/v4l-dvb/v4l/tm6000.c:293: warning: passing argument 1 of 'schedule_delayed_work' from incompatible pointer type
/home/rsgvv/v4l-dvb/v4l/tm6000.c: In function 'tm6000_start_stream':
/home/rsgvv/v4l-dvb/v4l/tm6000.c:297: warning: unused variable 'errCode'
/home/rsgvv/v4l-dvb/v4l/tm6000.c:297: warning: unused variable 'i'
/home/rsgvv/v4l-dvb/v4l/tm6000.c: In function 'tm6000_zl10353_i2c_xfer':
..............................................
/home/rsgvv/v4l-dvb/v4l/tm6000.c: In function 'probe':
/home/rsgvv/v4l-dvb/v4l/tm6000.c:2005: error: too few arguments to function 'dvb_register_adapter'
/home/rsgvv/v4l-dvb/v4l/tm6000.c:2059: warning: label 'err' defined but not used
make[3]: *** [/home/rsgvv/v4l-dvb/v4l/tm6000.o] Error 1
make[2]: *** [_module_/home/rsgvv/v4l-dvb/v4l] Error 2
make[2]: Leaving directory `/usr/src/kernels/2.6.25.11-97.fc9.i686'
make[1]: *** [default] Fout 2
make[1]: Map '/home/rsgvv/v4l-dvb/v4l' wordt verlaten
make: *** [all] Fout 2
[root@merom v4l-dvb]# tm6000.o] Error 1
bash: tm6000.o]: command not found
[root@merom v4l-dvb]# make[2]: *** [_module_/home/rsgvv/v4l-dvb/v4l] Error 2
bash: make[2]:: command not found
[root@merom v4l-dvb]# make[2]: Leaving directory `/usr/src/kernels/2.6.25.11-97.fc9.i686'
> make[1]: *** [default] Fout 2
> make[1]: Map '/home/rsgvv/v4l-dvb/v4l' wordt verlaten
> make: *** [all] Fout 2
> [root@merom v4l-dvb]#
>
[root@merom v4l-dvb]# clear

[root@merom v4l-dvb]# su make
su: gebruiker make bestaat niet
[root@merom v4l-dvb]# sudo make
make -C /home/rsgvv/v4l-dvb/v4l
make[1]: Map '/home/rsgvv/v4l-dvb/v4l' wordt binnengegaan
creating symbolic links...
Kernel build directory is /lib/modules/2.6.25.11-97.fc9.i686/build
make -C /lib/modules/2.6.25.11-97.fc9.i686/build SUBDIRS=/home/rsgvv/v4l-dvb/v4l modules
make[2]: Entering directory `/usr/src/kernels/2.6.25.11-97.fc9.i686'
CC [M] /home/rsgvv/v4l-dvb/v4l/tm6000.o
/home/rsgvv/v4l-dvb/v4l/tm6000.c: In function 'tm6000_poll_remote':
/home/rsgvv/v4l-dvb/v4l/tm6000.c:293: warning: passing argument 1 of 'schedule_delayed_work' from incompatible pointer type
/home/rsgvv/v4l-dvb/v4l/tm6000.c: In function 'tm6000_start_stream':
/home/rsgvv/v4l-dvb/v4l/tm6000.c:297: warning: unused variable 'errCode'
/home/rsgvv/v4l-dvb/v4l/tm6000.c:297: warning: unused variable 'i'
.........................................
/home/rsgvv/v4l-dvb/v4l/tm6000.c: In function 'probe':
/home/rsgvv/v4l-dvb/v4l/tm6000.c:2005: error: too few arguments to function 'dvb_register_adapter'
/home/rsgvv/v4l-dvb/v4l/tm6000.c:2059: warning: label 'err' defined but not used
make[3]: *** [/home/rsgvv/v4l-dvb/v4l/tm6000.o] Error 1
make[2]: *** [_module_/home/rsgvv/v4l-dvb/v4l] Error 2
make[2]: Leaving directory `/usr/src/kernels/2.6.25.11-97.fc9.i686'
make[1]: *** [default] Fout 2
make[1]: Map '/home/rsgvv/v4l-dvb/v4l' wordt verlaten
make: *** [all] Fout 2
[root@merom v4l-dvb]# clear

[root@merom v4l-dvb]# make
make -C /home/rsgvv/v4l-dvb/v4l
make[1]: Map '/home/rsgvv/v4l-dvb/v4l' wordt binnengegaan
creating symbolic links...
Kernel build directory is /lib/modules/2.6.25.11-97.fc9.i686/build
make -C /lib/modules/2.6.25.11-97.fc9.i686/build SUBDIRS=/home/rsgvv/v4l-dvb/v4l modules
make[2]: Entering directory `/usr/src/kernels/2.6.25.11-97.fc9.i686'
CC [M] /home/rsgvv/v4l-dvb/v4l/tm6000.o
/home/rsgvv/v4l-dvb/v4l/tm6000.c: In function 'tm6000_poll_remote':
/home/rsgvv/v4l-dvb/v4l/tm6000.c:293: warning: passing argument 1 of 'schedule_delayed_work' from incompatible pointer type
/home/rsgvv/v4l-dvb/v4l/tm6000.c: In function 'tm6000_start_stream':
....................................
/home/rsgvv/v4l-dvb/v4l/tm6000.c:2005: error: too few arguments to function 'dvb_register_adapter'
/home/rsgvv/v4l-dvb/v4l/tm6000.c:2059: warning: label 'err' defined but not used
make[3]: *** [/home/rsgvv/v4l-dvb/v4l/tm6000.o] Error 1
make[2]: *** [_module_/home/rsgvv/v4l-dvb/v4l] Error 2
make[2]: Leaving directory `/usr/src/kernels/2.6.25.11-97.fc9.i686'
make[1]: *** [default] Fout 2
make[1]: Map '/home/rsgvv/v4l-dvb/v4l' wordt verlaten
make: *** [all] Fout 2
[root@merom v4l-dvb]#
ln: cannot remove `./saa7110.c': Permission denied
ln: cannot remove `./vino.c': Permission denied
ln: cannot remove `./vivi.c': Permission denied
........................
ln: cannot remove `./w9968cf_decoder.h': Permission denied
ln: cannot remove `./saa7127.c': Permission denied
make[1]: *** [links] Fout 123
make[1]: Map '/home/rsgvv/v4l-dvb/v4l' wordt verlaten
make: *** [all] Fout 2
[rsgvv@merom v4l-dvb]$ makefile
bash: makefile: command not found
[rsgvv@merom v4l-dvb]$ su root
Wachtwoord:
[root@merom v4l-dvb]# make
make -C /home/rsgvv/v4l-dvb/v4l
make[1]: Map '/home/rsgvv/v4l-dvb/v4l' wordt binnengegaan
creating symbolic links...
Kernel build directory is /lib/modules/2.6.25.11-97.fc9.i686/build
make -C /lib/modules/2.6.25.11-97.fc9.i686/build SUBDIRS=/home/rsgvv/v4l-dvb/v4l modules
make[2]: Entering directory `/usr/src/kernels/2.6.25.11-97.fc9.i686'
CC [M] /home/rsgvv/v4l-dvb/v4l/tm6000.o
/home/rsgvv/v4l-dvb/v4l/tm6000.c: In function 'tm6000_poll_remote':
/home/rsgvv/v4l-dvb/v4l/tm6000.c:293: warning: passing argument 1 of 'schedule_delayed_work' from incompatible pointer type
/home/rsgvv/v4l-dvb/v4l/tm6000.c: In function 'tm6000_start_stream':
/home/rsgvv/v4l-dvb/v4l/tm6000.c:297: warning: unused variable 'errCode'
/home/rsgvv/v4l-dvb/v4l/tm6000.c:297: warning: unused variable 'i'
/home/rsgvv/v4l-dvb/v4l/tm6000.c: In function 'tm6000_zl10353_i2c_xfer':
/home/rsgvv/v4l-dvb/v4l/tm6000.c:421: warning: unused variable 'k'
..............................
/home/rsgvv/v4l-dvb/v4l/tm6000.c: In function 'probe':
/home/rsgvv/v4l-dvb/v4l/tm6000.c:2005: error: too few arguments to function 'dvb_register_adapter'
/home/rsgvv/v4l-dvb/v4l/tm6000.c:2059: warning: label 'err' defined but not used
make[3]: *** [/home/rsgvv/v4l-dvb/v4l/tm6000.o] Error 1
make[2]: *** [_module_/home/rsgvv/v4l-dvb/v4l] Error 2
make[2]: Leaving directory `/usr/src/kernels/2.6.25.11-97.fc9.i686'
make[1]: *** [default] Fout 2
make[1]: Map '/home/rsgvv/v4l-dvb/v4l' wordt verlaten
make: *** [all] Fout 2
[root@merom v4l-dvb]# clear

[root@merom v4l-dvb]# make
make -C /home/rsgvv/v4l-dvb/v4l
make[1]: Map '/home/rsgvv/v4l-dvb/v4l' wordt binnengegaan
creating symbolic links...
Kernel build directory is /lib/modules/2.6.25.11-97.fc9.i686/build
make -C /lib/modules/2.6.25.11-97.fc9.i686/build SUBDIRS=/home/rsgvv/v4l-dvb/v4l modules
make[2]: Entering directory `/usr/src/kernels/2.6.25.11-97.fc9.i686'
CC [M] /home/rsgvv/v4l-dvb/v4l/tm6000.o
/home/rsgvv/v4l-dvb/v4l/tm6000.c: In function 'tm6000_poll_remote':
/home/rsgvv/v4l-dvb/v4l/tm6000.c:293: warning: passing argument 1 of 'schedule_delayed_work' from incompatible pointer type
/home/rsgvv/v4l-dvb/v4l/tm6000.c: In function 'tm6000_start_stream':
/home/rsgvv/v4l-dvb/v4l/tm6000.c:297: warning: unused variable 'errCode'
/home/rsgvv/v4l-dvb/v4l/tm6000.c:297: warning: unused variable 'i'
/home/rsgvv/v4l-dvb/v4l/tm6000.c: In function 'tm6000_zl10353_i2c_xfer':
..............................................
/home/rsgvv/v4l-dvb/v4l/tm6000.c: In function 'probe':
/home/rsgvv/v4l-dvb/v4l/tm6000.c:2005: error: too few arguments to function 'dvb_register_adapter'
/home/rsgvv/v4l-dvb/v4l/tm6000.c:2059: warning: label 'err' defined but not used
make[3]: *** [/home/rsgvv/v4l-dvb/v4l/tm6000.o] Error 1
make[2]: *** [_module_/home/rsgvv/v4l-dvb/v4l] Error 2
make[2]: Leaving directory `/usr/src/kernels/2.6.25.11-97.fc9.i686'
make[1]: *** [default] Fout 2
make[1]: Map '/home/rsgvv/v4l-dvb/v4l' wordt verlaten
make: *** [all] Fout 2
[root@merom v4l-dvb]# tm6000.o] Error 1
bash: tm6000.o]: command not found
[root@merom v4l-dvb]# make[2]: *** [_module_/home/rsgvv/v4l-dvb/v4l] Error 2
bash: make[2]:: command not found
[root@merom v4l-dvb]# make[2]: Leaving directory `/usr/src/kernels/2.6.25.11-97.fc9.i686'
> make[1]: *** [default] Fout 2
> make[1]: Map '/home/rsgvv/v4l-dvb/v4l' wordt verlaten
> make: *** [all] Fout 2
> [root@merom v4l-dvb]#
>
[root@merom v4l-dvb]# clear

[root@merom v4l-dvb]# su make
su: gebruiker make bestaat niet
[root@merom v4l-dvb]# sudo make
make -C /home/rsgvv/v4l-dvb/v4l
make[1]: Map '/home/rsgvv/v4l-dvb/v4l' wordt binnengegaan
creating symbolic links...
Kernel build directory is /lib/modules/2.6.25.11-97.fc9.i686/build
make -C /lib/modules/2.6.25.11-97.fc9.i686/build SUBDIRS=/home/rsgvv/v4l-dvb/v4l modules
make[2]: Entering directory `/usr/src/kernels/2.6.25.11-97.fc9.i686'
CC [M] /home/rsgvv/v4l-dvb/v4l/tm6000.o
/home/rsgvv/v4l-dvb/v4l/tm6000.c: In function 'tm6000_poll_remote':
/home/rsgvv/v4l-dvb/v4l/tm6000.c:293: warning: passing argument 1 of 'schedule_delayed_work' from incompatible pointer type
/home/rsgvv/v4l-dvb/v4l/tm6000.c: In function 'tm6000_start_stream':
/home/rsgvv/v4l-dvb/v4l/tm6000.c:297: warning: unused variable 'errCode'
/home/rsgvv/v4l-dvb/v4l/tm6000.c:297: warning: unused variable 'i'
.........................................
/home/rsgvv/v4l-dvb/v4l/tm6000.c: In function 'probe':
/home/rsgvv/v4l-dvb/v4l/tm6000.c:2005: error: too few arguments to function 'dvb_register_adapter'
/home/rsgvv/v4l-dvb/v4l/tm6000.c:2059: warning: label 'err' defined but not used
make[3]: *** [/home/rsgvv/v4l-dvb/v4l/tm6000.o] Error 1
make[2]: *** [_module_/home/rsgvv/v4l-dvb/v4l] Error 2
make[2]: Leaving directory `/usr/src/kernels/2.6.25.11-97.fc9.i686'
make[1]: *** [default] Fout 2
make[1]: Map '/home/rsgvv/v4l-dvb/v4l' wordt verlaten
make: *** [all] Fout 2
[root@merom v4l-dvb]# clear

[root@merom v4l-dvb]# make
make -C /home/rsgvv/v4l-dvb/v4l
make[1]: Map '/home/rsgvv/v4l-dvb/v4l' wordt binnengegaan
creating symbolic links...
Kernel build directory is /lib/modules/2.6.25.11-97.fc9.i686/build
make -C /lib/modules/2.6.25.11-97.fc9.i686/build SUBDIRS=/home/rsgvv/v4l-dvb/v4l modules
make[2]: Entering directory `/usr/src/kernels/2.6.25.11-97.fc9.i686'
CC [M] /home/rsgvv/v4l-dvb/v4l/tm6000.o
/home/rsgvv/v4l-dvb/v4l/tm6000.c: In function 'tm6000_poll_remote':
/home/rsgvv/v4l-dvb/v4l/tm6000.c:293: warning: passing argument 1 of 'schedule_delayed_work' from incompatible pointer type
/home/rsgvv/v4l-dvb/v4l/tm6000.c: In function 'tm6000_start_stream':
....................................
/home/rsgvv/v4l-dvb/v4l/tm6000.c:2005: error: too few arguments to function 'dvb_register_adapter'
/home/rsgvv/v4l-dvb/v4l/tm6000.c:2059: warning: label 'err' defined but not used
make[3]: *** [/home/rsgvv/v4l-dvb/v4l/tm6000.o] Error 1
make[2]: *** [_module_/home/rsgvv/v4l-dvb/v4l] Error 2
make[2]: Leaving directory `/usr/src/kernels/2.6.25.11-97.fc9.i686'
make[1]: *** [default] Fout 2
make[1]: Map '/home/rsgvv/v4l-dvb/v4l' wordt verlaten
make: *** [all] Fout 2
[root@merom v4l-dvb]#
Terug naar boven
Profiel bekijken Stuur privébericht
klaasjan



Geregistreerd op: 22 Dec 2005
Berichten: 868

BerichtGeplaatst: Do Jul 31, 2008 3:23 pm    Onderwerp: Reageren met citaat

rsgvv schreef:
Het is opgelost Rolling Eyes Moest HQ installeren.
Maar nu duikt er weer een andere probleem op. Als ik na alle stappen de commando make opgeef. Dan krijg ik dit op het einde:


Die driver is bijna een jaar oud en werkt niet meer op recente Linux kernels. Bovendien staan op de door jou genoemde websites een paar grote waarschuwingen dat niet alle functionaliteit van die kaart werkt (in het beste geval krijg je alleen DVB-T (digitenne ned1/2/3) ontvangst).
Ik heb geen idee wat er aan de hand is met die driver, maar je beste gok is de auteur een mailtje sturen met de vraag wat de status is...
Terug naar boven
Profiel bekijken Stuur privébericht
rsgvv



Geregistreerd op: 11 Jun 2006
Berichten: 46

BerichtGeplaatst: Do Jul 31, 2008 5:04 pm    Onderwerp: Reageren met citaat

Die driver is bijna een jaar oud en werkt niet meer op recente Linux kernels. Bovendien staan op de door jou genoemde websites een paar grote waarschuwingen dat niet alle functionaliteit van die kaart werkt (in het beste geval krijg je alleen DVB-T (digitenne ned1/2/3) ontvangst).
Ik heb geen idee wat er aan de hand is met die driver, maar je beste gok is de auteur een mailtje sturen met de vraag wat de status is...[/quote]
Bedankt voor je reactie Klaas Jan, al heb ik alleen Nederland 1/2/3 is al heel wat beter dan niets. Maar om een email te sturen naar de auteur is mij te hoog gegrepen. Ben totaal niet goed in Engels. Zelfs in het Nederlands heb ik al moeite om niet te kromme zinnen te maken.
Terug naar boven
Profiel bekijken Stuur privébericht
Berichten van afgelopen:   
Nieuw onderwerp plaatsen   Reageren    Fedora-Linux.nl Forumindex -> Hardware Tijden zijn in GMT + 1 uur
Pagina 1 van 1

 
Ga naar:  
Je mag geen nieuwe onderwerpen plaatsen in dit subforum
Je mag geen reacties plaatsen in dit subforum
Je mag je berichten niet bewerken in dit subforum
Je mag je berichten niet verwijderen in dit subforum
Je mag niet stemmen in polls in dit subforum


Powered by phpBB © 2001, 2005 phpBB Group
Vertaling door Lennart Goosens.